{"text_format":"1","workbook":"xlsx","n_sheets":9,"sheets":["Istruzioni_Compilazione","Riepilogo Utenze","Dati Generali","Elenco Sedi","Mod. Attivazione Nuove Utenze","Mod. Attiv. Nuove Utenze MNP","Mod. Migraz. Utenze da Mobile 6","Mod. Migr. Utenze da altro Cont","Pick List"],"not_rendered":{"charts":0,"images":6,"macros":1,"external_links":0,"defined_names":41,"comments":0,"pivot_tables":0},"unopened":[],"bounds":{"document_bytes":16777216,"sheet_cells":100000,"rows_first":2000,"rows_last":500,"rows_between":2000,"halvings":0,"cell_chars":16384,"cell_head_chars":4096},"cells_cut":0,"cells_raw":0,"read":"whole","date_system":"1900"}

{"sheet":"Istruzioni_Compilazione","index":0,"n_rows":64,"n_cols":4,"rows_kept":64,"cut":false,"hidden":false,"merged":[[63,0,63,8],[46,0,46,8],[47,0,47,8],[48,0,48,8],[49,0,49,8],[50,0,50,8],[52,0,52,8],[53,0,53,8],[55,0,55,8],[56,0,56,8],[15,1,15,2],[15,3,15,8],[16,1,16,2],[16,3,16,8],[35,1,35,2],[35,3,35,8],[34,1,34,2],[34,3,34,8],[27,1,27,2],[27,3,27,8],[30,0,30,8],[31,0,31,8],[32,1,32,2],[32,3,32,8],[33,1,33,2],[33,3,33,8],[38,1,38,2],[38,3,38,8],[39,1,39,2],[39,3,39,8],[26,1,26,2],[36,1,36,2],[36,3,36,8],[37,1,37,2],[37,3,37,8],[26,3,26,8],[40,0,40,8],[54,0,54,8],[41,0,41,8],[42,0,42,8],[43,0,43,8],[44,0,44,8],[45,0,45,8],[51,0,51,8],[19,0,19,8],[20,0,20,8],[25,1,25,2],[25,3,25,8],[17,1,17,8],[18,0,18,8],[24,1,24,2],[24,3,24,8],[21,0,21,8],[23,1,23,2],[23,3,23,8],[8,0,8,8],[10,1,10,2],[10,3,10,8],[12,3,12,8],[4,0,4,8],[5,0,5,8],[6,0,6,8],[14,1,14,2],[14,3,14,8],[11,1,11,2],[11,3,11,8],[12,1,12,2],[13,3,13,8],[13,1,13,2],[7,0,7,8],[0,0,0,8],[1,0,1,8],[2,0,2,8],[3,0,3,8]]}
["Modulo Utenze (SIM) e relativa configurazione - Istruzioni per la compilazione"]
["1) Compilare il MODULO DATI GENERALI"]
["2) Compilare il MODULO ELENCO SEDI"]
["3) Il numero di utenze ricaricabili con profilo a pacchetto da immettere a sistema per l'ODA deve essere coerente con il numero complessivo di utenze risultante dal foglio 'Riepilogo Utenze\". In caso contrario l'ordinativo sarà rifiutato."]
["4) Compilare i moduli relativi alla caratterizzazione e configurazione delle SIM: MODULO ATTIVAZIONE NUOVE UTENZE, MODULO ATTIVAZIONE NUOVE UTENZE IN MNP, MODULO MIGRAZIONE UTENZE DA MOBILE 6, MODULO MIGRAZIONE UTENZE DA ALTRO CONTRATTO.\n"]
["5) Le SIM del contratto dovranno essere configurate dall’Amministrazione riempiendo le tabelle di cui si compongono i suddetti moduli. Ciascuna riga identificherà una SIM, oppure un gruppo di SIM omogenee per caratteristiche. Di seguito la legenda dei diversi campi:\n\n'-N. della Sede di consegna: indicare la sede, come definita nel MODULO ELENCO SEDI, in cui devono essere consegnate le SIM definite nella riga.\n\n'- Quantità (solo per attivazione nuove utenze): indicare il numero di SIM omogenee per caratteristiche di configurazione"]
["'- Mantenimento SIM/Sostituzione SIM: selezionare una delle due opzioni che prevedono il mantenimento della SIM o la sostituzione con una SIM Triple cut da 128k"]
["-N.B. : Per successivi cambi di SIM non imputabili a guasti o malfunzionamenti ma dovuti a mutate esigenze relative al terminale radiomobile su cui utilizzare la SIM stessa, è previsto un corrispettivo di 2,00 € a cambio."]
["-Pacchetto Traffico NAZ+SEE (Spazio Economico Europeo): selezionare il piano tariffario tra \"Pacchetto S1\", \"Pacchetto S4\", \"Pacchetto M4\", \"Pacchetto M20\",\"Pacchetto L4\", e \"Pacchetto L20\". Tale campo è obbligatorio."]
[]
{"$rows_left_out":55}
{"sheet":"Riepilogo Utenze","index":1,"n_rows":10,"n_cols":3,"rows_kept":10,"cut":false,"hidden":false,"merged":[[1,0,1,1]]}
[]
["Quantità utenze da inserire nell'ODA",null,"contatore automatico"]
[]
[null,"NOME VOCE A CATALOGO DA CERCARE:","quantità"]
[null,"Utenze Ricaricabili - Pacchetto - S1",{"$f":"SUMIF('Mod. Attivazione Nuove Utenze'!D4:D102,'Pick List'!B2,'Mod. Attivazione Nuove Utenze'!B4:B102)+COUNTIF('Mod. Attiv. Nuove Utenze MNP'!I4:I102,'Pick List'!B2)+COUNTIF('Mod. Migraz. Utenze da Mobile 6'!E4:E102,'Pick List'!B2)+COUNTIF('Mod. Migr. Utenze da altro Cont'!E4:E102,'Pick List'!B2)","v":0}]
[null,"Utenze Ricaricabili - Pacchetto - S4",{"$f":"SUMIF('Mod. Attivazione Nuove Utenze'!D4:D102,'Pick List'!B3,'Mod. Attivazione Nuove Utenze'!B4:B102)+COUNTIF('Mod. Attiv. Nuove Utenze MNP'!I4:I102,'Pick List'!B3)+COUNTIF('Mod. Migraz. Utenze da Mobile 6'!E4:E102,'Pick List'!B3)+COUNTIF('Mod. Migr. Utenze da altro Cont'!E4:E102,'Pick List'!B3)","v":0}]
[null,"Utenze Ricaricabili - Pacchetto - M4",{"$f":"SUMIF('Mod. Attivazione Nuove Utenze'!D4:D102,'Pick List'!B4,'Mod. Attivazione Nuove Utenze'!B4:B102)+COUNTIF('Mod. Attiv. Nuove Utenze MNP'!I4:I102,'Pick List'!B4)+COUNTIF('Mod. Migraz. Utenze da Mobile 6'!E4:E102,'Pick List'!B4)+COUNTIF('Mod. Migr. Utenze da altro Cont'!E4:E102,'Pick List'!B4)","v":0}]
[null,"Utenze Ricaricabili - Pacchetto - M20",{"$f":"SUMIF('Mod. Attivazione Nuove Utenze'!D4:D102,'Pick List'!B5,'Mod. Attivazione Nuove Utenze'!B4:B102)+COUNTIF('Mod. Attiv. Nuove Utenze MNP'!I4:I102,'Pick List'!B5)+COUNTIF('Mod. Migraz. Utenze da Mobile 6'!E4:E102,'Pick List'!B5)+COUNTIF('Mod. Migr. Utenze da altro Cont'!E4:E102,'Pick List'!B5)","v":0}]
[null,"Utenze Ricaricabili - Pacchetto - L4",{"$f":"SUMIF('Mod. Attivazione Nuove Utenze'!D4:D102,'Pick List'!B6,'Mod. Attivazione Nuove Utenze'!B4:B102)+COUNTIF('Mod. Attiv. Nuove Utenze MNP'!I4:I102,'Pick List'!B6)+COUNTIF('Mod. Migraz. Utenze da Mobile 6'!E4:E102,'Pick List'!B6)+COUNTIF('Mod. Migr. Utenze da altro Cont'!E4:E102,'Pick List'!B6)","v":11}]
[null,"Utenze Ricaricabili - Pacchetto - L20",{"$f":"SUMIF('Mod. Attivazione Nuove Utenze'!D4:D102,'Pick List'!B7,'Mod. Attivazione Nuove Utenze'!B4:B102)+COUNTIF('Mod. Attiv. Nuove Utenze MNP'!I4:I102,'Pick List'!B7)+COUNTIF('Mod. Migraz. Utenze da Mobile 6'!E4:E102,'Pick List'!B7)+COUNTIF('Mod. Migr. Utenze da altro Cont'!E4:E102,'Pick List'!B7)","v":8}]
{"$rows_left_out":1}
{"sheet":"Dati Generali","index":2,"n_rows":40,"n_cols":2,"rows_kept":40,"cut":false,"hidden":false,"merged":[[2,1,3,1],[25,0,25,2],[26,0,26,2],[0,0,0,1],[37,0,37,2],[31,0,31,2],[32,0,32,2],[33,0,33,2],[34,0,34,2],[35,0,35,2],[36,0,36,2],[27,0,27,2],[28,0,28,2],[5,1,6,1],[30,0,30,2],[20,0,20,2],[21,0,21,2],[22,0,22,2],[23,0,23,2],[29,0,29,2],[24,0,24,2],[10,1,11,1]]}
["Dati Generali"]
[]
["Nr. Identificativo Ordine ",5659785]
["l’ordine al quale si riferisce il presente allegato"]
[]
["Nr. Codice Contratto "]
["da indicare solo nel caso di ordinativo collegato, cioè di ampliamento di contratto in convenzione già esistente"]
[]
[]
[]
{"$rows_left_out":31}
{"sheet":"Elenco Sedi","index":3,"n_rows":34,"n_cols":8,"rows_kept":34,"cut":false,"hidden":false,"merged":[[0,0,0,7],[2,0,2,7],[3,2,3,7],[33,0,33,7],[36,1,37,1]]}
["Elenco Sedi"]
[]
["Elenco sedi di consegna delle SIM"]
["Numero totale sedi"]
["SEDE N.","DENOMINAZIONE","INDIRIZZO","COMUNE CAP","REFERENTE SEDE (*)","TELEFONO","FAX","E-MAIL"]
[1,"COMUNE DI SOVICILLE","PIAZZA MARCONI N. 1",53018,"CATIA MIGLIORINI","0577 049240","0577 314616","MIGLIORINI@COMUNE.SOVICILLE.SI.IT"]
[]
[]
[]
[]
{"$rows_left_out":25}
{"sheet":"Mod. Attivazione Nuove Utenze","index":4,"n_rows":106,"n_cols":16,"rows_kept":106,"cut":false,"hidden":false,"merged":[[1,0,1,9],[1,11,1,13],[0,0,0,14]]}
["Attivazione Nuove Utenze su profilo Ricaricabile"]
["Compilare la seguente tabella caratterizzando tutte le SIM richieste in base alle indicazioni per la caratterizzazione e configurazione delle SIM contenute nelle ISTRUZIONI PER LA COMPILAZIONE.\n(*) E' possibile richiedere l'attivazione di pacchetti incrementali durante la gestione dell'emergenza COVID-19, utilizzando la colonna denominata Pacchetto Traffico NAZ+SEE in sostituzione. (Es: Pacchetto L20 Gb + Opzione 40 Gb = 60Gb -  selezionare \"pacchetto L60\" nell'ultima colonna) -tale opzione decadrà automaticamente a fine emergenza Covid19 –",null,null,null,null,null,null,null,null,null,null,{"$f":"IF(P3,\"Attenzione: le Ricariche Sotto Soglia e la Ricarica One Shot se presenti entrambe vengono attivate in modo indipendente fra loro\",\"\")","v":""}]
["N. della Sede di consegna","Quantità","Tipologia Utenza","Pacchetto Traffico NAZ+SEE (*)","Traffico Over Bundle NAZ+SEE","Traffico Extra Bundle","Traffico Roaming EXTRA SEE  ","Traffico Roaming EXTRA SEE Over Pacchetto giornaliero","Soglie spesa dati roaming EXTRA SEE a consumo","Utenza Standard o Prioritaria","Modalità di Ricarica","Ricarica sotto soglia\n(soglia 4,95 €)","Ricarica d'emergenza (soglia 2,5 €)","Ricarica \"One Shot\"","Pacchetto Traffico NAZ+SEE in sostituzione (*)",{"$f":"SUM($P$4:$P$104)>0","v":false}]
[null,null,null,null,null,null,null,null,null,null,null,"6 €","N.A.","N.A.","N.A.",{"$f":"IF(AND(IF(L4=N.A.,0,1)+IF(M4=N.A.,0,1)>0,N4<>N.A.)=TRUE,1,0)","v":0}]
[null,null,null,null,null,null,null,null,null,null,null,"N.A.","N.A.","N.A.",null,{"$f":"IF(AND(IF(L5=N.A.,0,1)+IF(M5=N.A.,0,1)>0,N5<>N.A.)=TRUE,1,0)","v":0}]
[null,null,null,null,null,null,null,null,null,null,null,"N.A.","N.A.","N.A.",null,0]
[null,null,null,null,null,null,null,null,null,null,null,"N.A.","N.A.","N.A.",null,0]
[null,null,null,null,null,null,null,null,null,null,null,"N.A.","N.A.","N.A.",null,0]
[null,null,null,null,null,null,null,null,null,null,null,"N.A.","N.A.","N.A.",null,0]
[null,null,null,null,null,null,null,null,null,null,null,"N.A.","N.A.","22 €",null,0]
{"$rows_left_out":97}
{"sheet":"Mod. Attiv. Nuove Utenze MNP","index":5,"n_rows":106,"n_cols":21,"rows_kept":106,"cut":false,"hidden":false,"merged":[[1,0,1,11],[1,16,1,18],[0,0,0,19]]}
["Nuove Utenze in MNP: Profilo Ricaricabile"]
["Compilare la seguente tabella caratterizzando tutte le SIM richieste in base alle indicazioni per la caratterizzazione e configurazione delle SIM contenute nelle ISTRUZIONI PER LA COMPILAZIONE.\n(*) E' possibile richiedere l'attivazione di pacchetti incrementali durante la gestione dell'emergenza COVID-19, utilizzando la colonna denominata Pacchetto Traffico NAZ+SEE in sostituzione.(Es: Pacchetto L20 Gb + Opzione 40 Gb = 60Gb -  selezionare \"pacchetto L60\" nell'ultima colonna) -tale opzione decadrà automaticamente a fine emergenza Covid19 –",null,null,null,null,null,null,null,null,null,null,null,null,null,null,null,{"$f":"IF(U3,\"Attenzione: le Ricariche Sotto Soglia e la Ricarica One Shot se presenti entrambe vengono attivate in modo indipendente fra loro\",\"\")","v":""}]
["Numero Telefonico","Operatore Mobile","Prepagato/Post-Pagato","Numero seriale SIM","Nome e Cognome / Ragione Sociale","Codice Fiscale","N. della Sede di consegna","Tipologia Utenza","Traffico Over Bundle NAZ+SEE (*)","Traffico Over Bundle NAZ+SEE","Traffico Extra Bundle","Traffico Roaming EXTRA SEE  ","Traffico Roaming EXTRA SEE Over Pacchetto giornaliero","Soglie spesa dati roaming EXTRA SEE a consumo","Utenza Standard o Prioritaria","Modalità di Ricarica","Ricarica sotto soglia\n(soglia 4,95 €)","Ricarica d'emergenza (soglia 2,5 €)","Ricarica \"One Shot\"","Pacchetto Traffico NAZ+SEE in sostituzione (*)",{"$f":"SUM($U$4:$U$104)>0","v":false}]
[null,null,null,null,null,null,null,null,null,null,null,null,null,null,null,null,"6 €","N.A.","N.A.","N.A.",{"$f":"IF(AND(IF(Q4=N.A.,0,1)+IF(R4=N.A.,0,1)>0,S4<>N.A.)=TRUE,1,0)","v":0}]
[null,null,null,null,null,null,null,null,null,null,null,null,null,null,null,null,"N.A.","9 €","N.A.",null,0]
[null,null,null,null,null,null,null,null,null,null,null,null,null,null,null,null,"N.A.","N.A.","N.A.",null,0]
[null,null,null,null,null,null,null,null,null,null,null,null,null,null,null,null,"N.A.","N.A.","N.A.",null,0]
[null,null,null,null,null,null,null,null,null,null,null,null,null,null,null,null,"N.A.","N.A.","N.A.",null,0]
[null,null,null,null,null,null,null,null,null,null,null,null,null,null,null,null,"N.A.","N.A.","N.A.",null,0]
[null,null,null,null,null,null,null,null,null,null,null,null,null,null,null,null,"N.A.","N.A.","N.A.",null,0]
{"$rows_left_out":97}
{"sheet":"Mod. Migraz. Utenze da Mobile 6","index":6,"n_rows":106,"n_cols":17,"rows_kept":106,"cut":false,"hidden":false,"merged":[[1,0,1,10],[1,12,1,14],[0,0,0,16]]}
["Utenze intestate all'Amministrazione da migrare dalla Convenzione Mobile 6 su profilo Ricaricabile"]
["Compilare la seguente tabella caratterizzando tutte le SIM richieste in base alle indicazioni per la caratterizzazione e configurazione delle SIM contenute nelle ISTRUZIONI PER LA COMPILAZIONE.\n(*) E' possibile richiedere l'attivazione di pacchetti incrementali durante la gestione dell'emergenza COVID-19, utilizzando la colonna denominata Pacchetto Traffico NAZ+SEE in sostituzione. (Es: Pacchetto L20 Gb + Opzione 40 Gb = 60Gb -  selezionare \"pacchetto L60\" nell'ultima colonna) -tale opzione decadrà automaticamente a fine emergenza Covid19 –",null,null,null,null,null,null,null,null,null,null,null,"Attenzione: le Ricariche Sotto Soglia e la Ricarica One Shot se presenti entrambe vengono attivate in modo indipendente fra loro"]
["N. della Sede di consegna","Numero Telefonico","Mantenimento SIM/\nSostituzione SIM","Tipologia Utenza","Traffico Over Bundle NAZ+SEE (*)","Traffico Over Bundle NAZ+SEE","Traffico Extra Bundle","Traffico Roaming EXTRA SEE  ","Traffico Roaming EXTRA SEE Over Pacchetto giornaliero","Soglie spesa dati roaming EXTRA SEE a consumo","Utenza Standard o Prioritaria","Modalità di Ricarica","Ricarica sotto soglia\n(soglia 4,95 €)","Ricarica d'emergenza (soglia 2,5 €)","Ricarica \"One Shot\"","Pacchetto Traffico NAZ+SEE in sostituzione (*)",{"$f":"SUM($Q$4:$Q$104)>0","v":false}]
[1,"320 4317200","Mantenimento","Fonia_Dati","Pacchetto_L20","Disabilitato - Attenzione per l'attivazione della prestazione deve essere presente almeno una ricarica sotto soglia o una ricarica di emergenza","Bloccato","N.A.","N.A.","N.A.","Standard","Rinuncia","N.A.","N.A.","N.A.",null,{"$f":"IF(AND(IF(M4=N.A.,0,1)+IF(N4=N.A.,0,1)>0,O4<>N.A.)=TRUE,1,0)","v":0}]
[1,"320 4317208","Nuova SIM 128K Triple Cut","Fonia_Dati","Pacchetto_L20","Disabilitato - Attenzione per l'attivazione della prestazione deve essere presente almeno una ricarica sotto soglia o una ricarica di emergenza","Bloccato","N.A.","N.A.","N.A.","Standard","Rinuncia","N.A.","N.A.","N.A.",null,0]
[1,"320 4317209","Nuova SIM 128K Triple Cut","Fonia_Dati","Pacchetto_L20","Disabilitato - Attenzione per l'attivazione della prestazione deve essere presente almeno una ricarica sotto soglia o una ricarica di emergenza","Bloccato","N.A.","N.A.","N.A.","Standard","Rinuncia","N.A.","N.A.","N.A.",null,0]
[1,"329 2606971","Nuova SIM 128K Triple Cut","Fonia_Dati","Pacchetto_L20","Disabilitato - Attenzione per l'attivazione della prestazione deve essere presente almeno una ricarica sotto soglia o una ricarica di emergenza","Bloccato","N.A.","N.A.","N.A.","Standard","Rinuncia","N.A.","N.A.","N.A.",null,0]
[1,"329 2606972","Nuova SIM 128K Triple Cut","Fonia_Dati","Pacchetto_L4","Disabilitato - Attenzione per l'attivazione della prestazione deve essere presente almeno una ricarica sotto soglia o una ricarica di emergenza","Bloccato","N.A.","N.A.","N.A.","Standard","Rinuncia","N.A.","N.A.","N.A.",null,0]
[1,"336 706748","Nuova SIM 128K Triple Cut","Fonia_Dati","Pacchetto_L20","Disabilitato - Attenzione per l'attivazione della prestazione deve essere presente almeno una ricarica sotto soglia o una ricarica di emergenza","Bloccato","N.A.","N.A.","N.A.","Standard","Rinuncia","N.A.","N.A.","N.A.",null,0]
[1,"339 4011642","Nuova SIM 128K Triple Cut","Fonia_Dati","Pacchetto_L4","Disabilitato - Attenzione per l'attivazione della prestazione deve essere presente almeno una ricarica sotto soglia o una ricarica di emergenza","Bloccato","N.A.","N.A.","N.A.","Standard","Rinuncia","N.A.","N.A.","N.A.",null,0]
{"$rows_left_out":97}
{"sheet":"Mod. Migr. Utenze da altro Cont","index":7,"n_rows":106,"n_cols":17,"rows_kept":106,"cut":false,"hidden":false,"merged":[[0,0,0,10],[1,0,1,10],[1,12,1,14]]}
["Utenze intestate all'Amministrazione (non in Convenzione Mobile 6) da migrare su profilo Ricaricabile"]
["Compilare la seguente tabella caratterizzando tutte le SIM richieste in base alle indicazioni per la caratterizzazione e configurazione delle SIM contenute nelle ISTRUZIONI PER LA COMPILAZIONE.\n(*) E' possibile richiedere l'attivazione di pacchetti incrementali durante la gestione dell'emergenza COVID-19, utilizzando la colonna denominata Pacchetto Traffico NAZ+SEE in sostituzione. (Es: Pacchetto L20 Gb + Opzione 40 Gb = 60Gb -  selezionare \"pacchetto L60\" nell'ultima colonna) -tale opzione decadrà automaticamente a fine emergenza Covid19 –",null,null,null,null,null,null,null,null,null,null,null,{"$f":"IF(Q3,\"Attenzione: le Ricariche Sotto Soglia e la Ricarica One Shot se presenti entrambe vengono attivate in modo indipendente fra loro\",\"\")","v":""}]
["N. della Sede di consegna","Numero Telefonico","Mantenimento SIM/\nSostituzione SIM","Tipologia Utenza","Pacchetto Traffico NAZ+SEE (*)","Traffico Over Bundle NAZ+SEE","Traffico Extra Bundle","Traffico Roaming EXTRA SEE  ","Traffico Roaming EXTRA SEE Over Pacchetto giornaliero","Soglie spesa dati roaming EXTRA SEE a consumo","Utenza Standard o Prioritaria","Modalità di Ricarica","Ricarica sotto soglia\n(soglia 4,95 €)","Ricarica d'emergenza (soglia 2,5 €)","Ricarica \"One Shot\"","Pacchetto Traffico NAZ+SEE in sostituzione (*)",{"$f":"SUM($Q$4:$Q$104)>0","v":false}]
[1,"334 9453386","Nuova SIM 128K Triple Cut","Fonia_Dati","Pacchetto_L4","Disabilitato - Attenzione per l'attivazione della prestazione deve essere presente almeno una ricarica sotto soglia o una ricarica di emergenza","Bloccato","N.A.","N.A.","N.A.","Standard","Rinuncia","N.A.","N.A.","N.A.",null,{"$f":"IF(AND(IF(M4=N.A.,0,1)+IF(N4=N.A.,0,1)>0,O4<>N.A.)=TRUE,1,0)","v":0}]
[1,"334 9453525","Nuova SIM 128K Triple Cut","Fonia_Dati","Pacchetto_L4","Disabilitato - Attenzione per l'attivazione della prestazione deve essere presente almeno una ricarica sotto soglia o una ricarica di emergenza","Bloccato","N.A.","N.A.","N.A.","Standard","Rinuncia","N.A.","N.A.","N.A.",null,0]
[1,"333 1642607","Nuova SIM 128K Triple Cut","Fonia_Dati","Pacchetto_L4","Disabilitato - Attenzione per l'attivazione della prestazione deve essere presente almeno una ricarica sotto soglia o una ricarica di emergenza","Bloccato","N.A.","N.A.","N.A.","Standard","Rinuncia","N.A.","N.A.","N.A.",null,0]
[1,"333 1643024","Nuova SIM 128K Triple Cut","Fonia_Dati","Pacchetto_L4","Disabilitato - Attenzione per l'attivazione della prestazione deve essere presente almeno una ricarica sotto soglia o una ricarica di emergenza","Bloccato","N.A.","N.A.","N.A.","Standard","Rinuncia","N.A.","N.A.","N.A.",null,0]
[1,"333 1643075","Nuova SIM 128K Triple Cut","Fonia_Dati","Pacchetto_L4","Disabilitato - Attenzione per l'attivazione della prestazione deve essere presente almeno una ricarica sotto soglia o una ricarica di emergenza","Bloccato","N.A.","N.A.","N.A.","Standard","Rinuncia","N.A.","N.A.","N.A.",null,0]
[1,"333 1643225","Nuova SIM 128K Triple Cut","Fonia_Dati","Pacchetto_L4","Disabilitato - Attenzione per l'attivazione della prestazione deve essere presente almeno una ricarica sotto soglia o una ricarica di emergenza","Bloccato","N.A.","N.A.","N.A.","Standard","Rinuncia","N.A.","N.A.","N.A.",null,0]
[1,"333 1643392","Nuova SIM 128K Triple Cut","Fonia_Dati","Pacchetto_L4","Disabilitato - Attenzione per l'attivazione della prestazione deve essere presente almeno una ricarica sotto soglia o una ricarica di emergenza","Bloccato","N.A.","N.A.","N.A.","Standard","Rinuncia","N.A.","N.A.","N.A.",null,0]
{"$rows_left_out":97}
{"sheet":"Pick List","index":8,"n_rows":16,"n_cols":13,"rows_kept":16,"cut":false,"hidden":true,"merged":[]}
[null,"Pacchetto Traffico NAZ+SEE","Traffico\nOver Bundle NAZ+SEE","Traffico Extra Bundle","Traffico Roaming EXTRA SEE  ","Traffico Roaming EXTRA SEE Over Pacchetto giornaliero","Soglie spesa dati roaming EXTRA SEE","Profili di abilitazione RPV","Modalità di Ricarica","Ricarica sotto soglia (soglia 4,95)","Ricarica d'emergenza\n(soglia 2,5 €)","Ricarica \"One Shot\"","Varie"]
[null,"Pacchetto_S1","Disabilitato","Bloccato","N.A.","","N.A.","Gruppo RPV","Rinuncia","N.A.","N.A.","N.A.","Standard"]
[null,"Pacchetto_S4","Abilitato (traffico a consumo)","Abilitato","Pacchetto_giornaliero_R50","Bloccato","Soglia Informativa 50€","Profilo 1","Conferma","6 €","9 €","7 €","Prioritaria"]
[null,"Pacchetto_M4",null,"Abilitato_TIM_TUO_ROAMING_ON_EXTRA_SEE","Pacchetto_giornaliero_R100","Abilitato","Soglia Dispositiva 50€","Profilo 2",null,"12 €",null,"22 €"]
[null,"Pacchetto_M20","N.A.",null,"A_carico_Dipendente","N.A.","Soglia Informativa 100€","Profilo 3",null,"24 €",null,"44 €","Fonia_Dati"]
[null,"Pacchetto_L4",null,null,null,null,"Soglia Dispositiva 100 €","Profilo 4",null,"48 €",null,"88 €"]
[null,"Pacchetto_L20",null,"Disabilitato - Attenzione per l'attivazione della prestazione deve essere presente almeno una ricarica sotto soglia o una ricarica di emergenza",null,null,"Soglia Informativa 150€","Profilo 5",null,null,null,null,"Utenza Ricaricabile a Pacchetto - Pacchetto S1"]
[null,null,null,null,null,null,"Soglia Dispositiva 150€","Profilo 6",null,null,null,null,"Utenza Ricaricabile a Pacchetto - Pacchetto S4"]
[null,"N.A.",null,null,null,null,null,"Profilo 7","=J2&K2",null,null,null,"Utenza Ricaricabile a Pacchetto - Pacchetto M4"]
[null,"Pacchetto_L60",null,null,null,null,"Soglia 50€ Dipendente","Profilo 8",null,null,null,null,"Utenza Ricaricabile a Pacchetto - Pacchetto M20"]
{"$rows_left_out":6}